﻿OBJECTID,Name,Spheroid,CentralMeridian_DMS,CentralMeridian_DD,CentralScaleFactor,False_Easting,False_Northing,Height,AHDtoSpheroid,Description,Entered_Date,West_Longitude,South_Latitude,East_Longitude,North_Latitude,GlobalID,SHAPE_Length,SHAPE_Area
1,AMELUP2020,GDA2020,118 19 0,118.316666666667,1.0000396,50000,4100000,280.03,-28,GDA2020,2017/03/31 08:00:00+00,117.914166654,-34.589166642,118.46222228,-33.84583339,{54328EDF-F048-4CDF-BAE9-378C97EF0D22},2.58277775600016,0.407387970751531
2,WYLOO2020,GDA2020,116 30 0,116.5,1.00003802,50000,2900000,249.974,-8,Wyloo GDA2020 Project Zone,2017/03/31 08:00:00+00,116.268888903,-22.9344443809999,116.787222278,-22.5830555049999,{6F6A0303-E389-4AA6-83FD-9688D34C71A0},1.73944450199997,0.182136582034529
3,JOPE2020,GDA2020,117 29 ,117.483333333333,1.00007102,50000,2850000,460,-8,Jope GDA2020 Project Zone,2017/03/31 08:00:00+00,117.265555529,-23.220555506,117.823611155,-22.683055505,{54D986E0-2FAD-4D79-BD4F-FFCD2A38F1E2},2.19111125400013,0.299954899533092
4,BOXWOOD2020,GDA2020,118 45 0,118.75,1.000011,50000,4100000,100.008,-30,Bremer Bay Turn Off,2017/03/31 08:00:00+00,118.379444405,-34.636388891,119.119166656,-34.174166641,{B3CFC31A-6092-45E6-BD0A-5622999303EB},2.40388900199991,0.341916083232256
5,HARMS2020,GDA2020,123 14 ,123.233333333333,1.00002781,50000,3900000,199.994,-23,Eyre Highway adjacent to Balla2020,2017/03/31 08:00:00+00,122.989166659,-32.4180555139999,123.665833285,-32.0336111389999,{96155126-79ED-4B08-B5BE-FF02880A582E},2.12222200200006,0.260140678115936
6,JILLBUNDA2020,GDA2020,125 43 ,125.716666666667,1.000013,50000,3900000,102.737,-20,Eyre Highway,2017/03/31 08:00:00+00,125.293888911,-32.3711111389999,126.130555538,-31.7488888889999,{B11C9F33-64F9-41CC-B0A1-A30844138B72},2.91777775399999,0.520592591151845
7,WITTENOOM2020,GDA2020,118 4 ,118.066666666667,1.00008218,50000,2800000,530.026,-7,GDA2020 WITTENOOM AND SURROUNDS,2017/03/31 08:00:00+00,117.787500029,-22.412500005,118.311111155,-22.092777755,{334014FB-C83A-4D74-B81A-7A0DB186BC0E},1.68666675199995,0.167410127329742
8,LOGUE2020,GDA2020,123 1 ,123.016666666667,1.000008,50000,2300000,30.915,20,GDA2020,2017/03/31 08:00:00+00,122.616388909,-17.9005555009999,123.485833284,-17.5297222509999,{C73017AA-DA77-4E92-A7E2-433D4D3B5399},2.48055524999984,0.322418883275427
9,AGLIME2020,GDA2020,116 25 00,116.416666666667,1.00003174,50000,3850000,230.006,-28,Aglime Cartage Routes,2017/03/31 08:00:00+00,115.973055528,-32.8683333889999,116.860277778,-30.3716666369999,{552E8EB0-2952-4B76-A234-C0A32E98C346},6.76777800400009,2.21509829320973
10,ALB2020,GDA2020,117 53 0,117.883333333334,1.0000044,50000,4100000,190,,,,117.535555529,-35.183888892,118.231111154,-34.451944391,{3EF6A944-78D8-4472-8EFB-520E54A5B28D},2.85500025199997,0.509108114858357
11,AMBANIA2020,GDA2020,115 15 0,115.25,1.0000308,50000,3550000,220.024,-24,Infill,2017/03/31 08:00:00+00,114.933234277,-29.178373012,115.566765777,-28.15496001,{86B28F44-54E4-4E3D-B808-FAF9A56C61E3},3.31388900400009,0.648364374276593
12,BALLA2020,GDA2020,123 53 00,123.883333333333,1.00001901,50000,4000000,144.987,-24,Balladonia Roadhouse and environs,2017/03/31 08:00:00+00,123.475277785,-32.7016666399999,124.29138891,-32.1391666389999,{027F2C6E-2900-403B-B07E-13248C3673D9},2.75722225199979,0.45906250862855
13,BCG2020,GDA2020,115 26 0,115.433333333334,0.99999592,50000,4000000,250,,,,114.981988277,-34.4145605159999,115.884678403,-33.0379582649999,{42B9D6E3-885C-42BB-A96A-68192BF32C52},4.55858475400009,1.24264525940713
14,BRDGETWN2020,GDA2020,116 9 0,116.15,1.00003425,50000,4100000,246.981,-29,Bridgetown Townsite Grid,2017/03/31 08:00:00+00,115.796799028,-34.5305750159999,116.503201028,-32.8775930149999,{0CC40D85-F4CE-4182-8B10-94420AC7CAF3},4.71876800200005,1.16766979147044
15,BROOKTON2020,GDA2020,117 0 0,117,1.00004132,50000,3900000,289.977,-27,Brookton Hwy and surrounds 2,2017/03/31 08:00:00+00,116.576087654,-33.2707890149999,117.423912404,-31.4290860129999,{1CF0846F-9DD6-4B9E-B2C4-55A181DE876A},5.37905550399989,1.56144138724483
16,CARN2020,GDA2020,113 40 0,113.666666666667,0.99999796,50000,3050000,,,,,113.127133169,-26.8970346789999,114.206200161,-23.2962999999999,{48CBD22D-EA2A-47D9-AE9D-9AB38D33EEE5},9.35960334200001,3.88543393905857
17,CHEELA2020,GDA2020,117 0 0,117,1.00005059,50000,2900204,329.975,-8,Nanutarra - Wittenoom,2017/03/31 08:00:00+00,116.694166653,-23.2391666309999,117.305833279,-22.7216666309999,{C05639B9-60B2-45B9-954B-4F260939B3CB},2.25833325199994,0.316537478954984
18,COL2020,GDA2020,115 56 0,115.933333333334,1.000019,40000,4100000,310,,,,115.578333277,-34.417500016,116.288888903,-33.23916664,{6AA7306F-60B2-4174-8D29-234B88C418A5},3.77777800399997,0.83727140962035
19,COOROW2020,GDA2020,115 55 ,115.916666666667,1.00003504,50000,3700000,250.009,-27,GDA2020 Coorow,2017/03/31 08:00:00+00,115.493132152,-30.7679360129999,116.340202153,-29.3004770119999,{D6161429-4BDE-442C-A822-4F2BE50C82F5},4.62905800400006,1.24304049744457
20,CORRIG2020,GDA2020,117 35 ,117.583333333333,1.0000407,50000,3950000,285.031,-26,Brookton Hwy,2017/03/31 08:00:00+00,117.105314779,-33.0305360149999,118.06135178,-31.7313510139999,{E69989F2-A989-4078-AD53-ACA313C3ACF5},4.51044400400008,1.24206893210027
21,CRANBK2020,GDA2020,117 31 ,117.516666666667,1.00003582,50000,4200000,255.973,-28,South of Mt Barker TS to,2017/03/31 08:00:00+00,117.078166279,-34.8600950159999,117.955167155,-32.6153005139999,{85C51E9F-79AA-4DF5-B8F2-997D894A8042},6.243590756,1.968686744694
22,DERBY2020,GDA2020,123 41 ,123.683333333333,1.00000393,50000,2300000,5.01209,20,Derby Townsite and surrounds,2017/03/31 08:00:00+00,123.307506284,-18.2562227509999,124.05916041,-16.8609956249999,{45DF5EE9-8217-44AC-91F1-2900AF943C24},4.29376250400014,1.04872822596512
23,ESP2020,GDA2020,121 53 0,121.883333333334,1.0000055,50000,4050000,,,,,121.455922658,-34.0552388909999,122.310744034,-33.3377995149999,{BD40D673-1EE7-4C3C-84A6-8B9FD99153E8},3.14452150400007,0.613282514588928
24,EXM2020,GDA2020,114 4 0,114.066666666667,1.00000236,50000,2750000,160,,,,113.606378709,-23.36694933,114.52695462,-21.728543389,{D02E12D8-80D3-4747-A4AD-1B0A348D2B62},5.11796370400009,1.50827704172394
25,FITZROY2020,GDA2020,125 34 ,125.566666666667,1.00002247,50000,2400000,120.008,23,Fitzroy Grid,2017/03/31 08:00:00+00,125.250872786,-18.718609751,125.882460537,-17.901901501,{89D6A665-4095-4205-BE8F-39C588B3BCCB},2.89659200199992,0.515822926840618
26,FORTES2020,GDA2020,115 56 ,115.933333333333,1.00001728,50000,2727968,117.977,-8,NWCH,2017/03/31 08:00:00+00,115.557492902,-22.268503005,116.336286903,-20.659988004,{3E98BD6A-3998-4FAC-9ED4-1E135E7681DD},4.7746180040001,1.25270183329739
27,GCG2020,GDA2020,114 35 0,114.583333333334,1.00000628,50000,3450000,195,,,,114.147459071,-29.24300342,115.019207599,-28.08772503,{7B463D9C-0C28-4064-BFD9-EED723819997},4.05405383599998,1.0071122359127
28,GIBB22020,GDA2020,124 33 ,124.55,1.00001571,50000,2100000,74.9847,25,70-150 SLK Kimberley Downs - Stumps Jumpup,2017/03/31 08:00:00+00,124.24419141,-18.307329001,124.921694786,-16.208105,{AE989845-9589-4BD0-9293-D0404E06F098},5.55345475399997,1.42223134765772
29,GIRALIA2020,GDA2020,114 43 ,114.716666666667,1.00000424,50000,2800000,39.9851,-13,NWCH,2017/03/31 08:00:00+00,114.321691776,-23.328676006,115.131958902,-21.607326004,{24E6930A-4683-4ED5-BCC8-26384E847719},5.06323425599987,1.39475331896057
30,GOLD2020,GDA2020,121 30 0,121.5,1.00004949,60000,3800000,,,,,121.113573899,-32.773778261,121.8864261,-28.59298451,{BEF32793-18DE-4823-A216-BB1305648E43},9.9072919040002,3.23113565238779
31,H1BANWIL2020,GDA2020,116 40 ,116.666666666667,1.00004447,50000,4000000,310.025,-27,Nth Banister to Williams 97 - 158 SLK,2017/03/31 08:00:00+00,116.275606528,-33.816244016,117.057725904,-31.913247014,{3FDA07FE-F3EF-4EF0-ADD4-54F47FE25589},5.37023275600018,1.48837082773427
32,H6BOW2020,GDA2020,128 10 ,128.166666666667,1.00004761,50000,2250000,270.009,33,Bow River GDA2020,2017/03/31 08:00:00+00,127.891029914,-17.5210721249999,128.44230254,-16.3123812499999,{0A7A0B3D-4630-4813-8948-699A86EC9D1C},3.5199270019998,0.666318192683368
33,H6ORD2020,GDA2020,127 47 ,127.783333333333,1.00005641,50000,2350000,370.016,-11,H6 2818 - 2931 SLK 2,2017/03/31 08:00:00+00,127.424867914,-20.344736503,128.141799789,-17.117705,{D3955FE7-8AD5-4879-A438-E8DE2530308A},7.88792675599996,2.31356174612984
34,H9BRIVER2020,GDA2020,116 59 ,116.983333333333,1.0000099,50000,4230000,100.008,-37,South West Hwy 390 - 450 SLK (H9BOWRIVER 2020),2017/03/31 08:00:00+00,116.571944403,-35.156944392,117.394722279,-34.366944392,{D65F948E-C385-492A-AE21-1C07D211AB72},3.22555575199988,0.649994522039952
35,HUG2020,GDA2020,116 14 ,116.233333333333,1.00003472,50000,4100000,249.972,-29,East of Darling Range 2,2017/03/31 08:00:00+00,115.873888903,-33.8202777659999,116.567777779,-30.4233333869999,{6B8BA218-A11F-4909-83A0-0AE95B1FF0B5},8.1816665099999,2.35710191697869
36,JCG2020,GDA2020,114 59 0,114.983333333334,1.00000314,50000,3650000,200,,,,114.649932319,-31.04798205,115.31673435,-29.21425233,{46F5A977-38BA-4F4B-A437-D04BD2C52304},5.00106350199997,1.22273470160102
37,JERRATS2020,GDA2020,118 54 0,118.9,1.00003472,50000,4130000,249.972,-29,Brome Hill to Jerra,2017/03/31 08:00:00+00,118.49935828,-34.346816766,119.30064178,-33.76860764,{7679DD47-0C18-461B-B752-E4DBC20D3F65},2.75898525200023,0.463309432213298
38,KALBARRI2020,GDA2020,114 19 ,114.316666666667,1.00001995,50000,3400000,146.97,-20,NWCH between Gertn and Carnvn,2017/03/31 08:00:00+00,113.957186276,-28.296882011,114.697754651,-26.635055134,{7F02F3BC-D745-41EB-B24D-20E2B3B7C314},4.80479050400015,1.23069642983133
39,KAR2020,GDA2020,116 56 0,116.933333333334,0.9999989,50000,2550000,,,,,116.49924435,-21.257840491,117.36742231,-20.4965152,{40C03582-59C0-4A39-846F-FF8BD3DD1689},3.25900650200003,0.660965838036798
40,KOJON2020,GDA2020,117 3 ,117.05,1.00003818,50000,4100000,269.993,-27,Kojunup Townsite,2017/03/31 08:00:00+00,116.579740028,-34.615450766,117.52026003,-33.04151939,{66A35452-C326-4705-A3BE-C7ABFD4699FD},5.02890275599987,1.4803139409033
41,KONDININ2020,GDA2020,118 12 0,118.2,1.00004305,50000,3940000,299.987,-26,Brookton Highway 123,2017/03/31 08:00:00+00,117.70351528,-33.078126015,118.696484656,-31.664726014,{7EEABC4A-0C2B-4E52-A2B9-F06448D08F45},4.81273875400007,1.40346291703141
42,KUN2020,GDA2020,128 45 0,128.75,1.0000165,50000,2100000,200,,,,128.425988199,-16.403773531,129.0740118,-14.756085631,{F667028C-D7C3-4514-96ED-7114105EA344},4.59142299800021,1.06774064498624
43,LCG2020,GDA2020,115 22 0,115.366666666667,1.00000157,50000,3750000,200,,,,114.963779929,-31.8328990099999,115.769553401,-29.3805449599999,{23D1E4D1-564E-4EE5-B813-63E0A86EF156},6.51625504399988,1.97604183744162
44,LEWIS2020,GDA2020,128 48 0,128.8,1.00006662,50000,2600000,400.996,23,Tanami Road,2017/03/31 08:00:00+00,128.501360539,-20.327522003,129.09863954,-19.372478002,{A45F6F0A-64DE-4FC3-AAA7-023E0EC786C7},3.10464600399996,0.570427726828292
45,MARBLE2020,GDA2020,119 51 ,119.85,1.00002388,50000,2700000,150.982,1,MARBLE BAR ROAD,2017/03/31 08:00:00+00,119.587260156,-21.2623802539999,120.112739907,-20.4577507529999,{A8960C0D-2B59-48C2-9D95-06D9E392ABBB},2.66021850400011,0.422816509832774
46,MENZIES2020,GDA2020,121 4 ,121.066666666667,1.00006489,50000,3600000,433.986,-21,Menzies Townsite,2017/03/31 08:00:00+00,120.808273157,-30.2001200129999,121.325060158,-29.1665470109999,{086B32B2-9C1C-4262-9B31-B90A7A200378},3.10072000600007,0.534137092018172
47,MORLEY2020,GDA2020,117 28 ,117.466666666667,1.00000126,50000,4200000,40.0191,-32,GDA2020 East of Denmark,2017/03/31 08:00:00+00,117.096363654,-35.1461130169999,117.836970655,-34.6758720169999,{E07EC97B-AF5C-421E-B490-785A8C95B006},2.42169600200009,0.348263776757259
48,MRCG2020,GDA2020,115 10 0,115.166666666667,1.0000055,50000,4050000,200,,,,114.839788401,-34.4153127659999,115.493544902,-33.5062161399999,{4254F2A1-06A4-4DB6-9719-4234A62A63A8},3.12570625399997,0.594327829284648
49,MTMAGSTH2020,GDA2020,117 48 ,117.8,1.00006269,50000,3500000,419.984,-21,GNH -  Between Mt Magnet and Paynes Find,2017/03/31 08:00:00+00,117.511676279,-29.403735887,118.08832378,-28.067519761,{B7EF4D66-EF4C-42F2-9AFD-DD4DB187076A},3.82572725400007,0.770525689853841
50,MUELLER2020,GDA2020,128 18 0,128.3,1.00006096,50000,2500000,364.974,23,Tanami Road,2017/03/31 08:00:00+00,127.920773414,-20.2606610029999,128.679226539,-19.3060050029999,{ADE6F581-2974-41A7-8B79-45C30C3E35F8},3.42621824999992,0.724061826499962
51,NANU2020,GDA2020,115 25 ,115.416666666667,1.00000786,50000,2800000,60.0242,-10,NWCH,2017/03/31 08:00:00+00,115.019823027,-23.179199006,115.813510277,-21.252618754,{F7947E46-F0A7-4346-8138-C066693EC3AE},5.44053500400014,1.52910218211431
52,NARROGIN2020,GDA2020,117 10 ,117.166666666667,1.00004541,50000,4000000,315.007,-26,Narrogin GDA2020,2017/03/31 08:00:00+00,116.727957028,-33.468154016,117.605375279,-32.398513014,{C15866A1-26EC-4553-BF17-0EBC55BFC2C8},3.89411850599993,0.938522537172694
53,NEWGATE2020,GDA2020,119 3 ,119.05,1.00004447,50000,4000000,310.025,-27,Newdegate GDA2020,2017/03/31 08:00:00+00,118.629903031,-33.6358100159999,119.470097031,-32.5641900149999,{C97FF4E4-5552-4F01-973E-7DCC11BB5824},3.82362800199996,0.900368695120178
54,NEWMAN2020,GDA2020,119 43 ,119.716666666667,1.00008862,50000,2950000,569.013,-5,Newman townsite and surrounds 2 3,2017/03/31 08:00:00+00,119.332777781,-24.734722258,120.100555531,-22.909444506,{1460965B-8C17-427F-9843-EB207DC20277},5.18611100399983,1.40140764555548
55,NULL2020,GDA2020,120 6 ,120.1,1.00006128,50000,2781676,391.01,-1,Nullagine Townsite GDA2020,2017/03/31 08:00:00+00,119.687577282,-22.91131188,120.512422657,-21.193910004,{C7CACCEE-DE21-4AAB-AC11-DE5F6CF9F8E1},5.08449450200021,1.41659099443511
56,PCG2020,GDA2020,115 49 0,115.816666666667,0.99999906,50000,3900000,165,,,,115.472468403,-33.709061516,116.160864903,-31.012841763,{A8613466-1638-4F88-BD52-5445AE183D86},6.76923250599998,1.85606824119596
57,PHG2020,GDA2020,118 36 0,118.6,1.00000135,50000,2500000,,,,,118.1825291,-21.253365131,119.0174709,-20.11029004,{80B87FE9-6836-41A2-AF8A-5D665D635909},3.95603378200008,0.954401174014743
58,PINDARTS2020,GDA2020,115 48 ,115.8,1.00004321,50000,3500000,296.006,-21,Pindar Townsite and surroundings,2017/03/31 08:00:00+00,115.485302778,-29.5416051359999,116.114697153,-27.7372135099999,{6B9D17D5-95DD-43C7-AA82-C31230A246EB},4.86757200200009,1.1356739397016
59,RAVENS2020,GDA2020,120 2 ,120.033333333333,1.0000319,50000,4100000,210.024,-7,Ravensthorpe Townsite and Surrounds GDA2020,2017/03/31 08:00:00+00,119.743383531,-33.663783015,120.323282157,-33.303217765,{EE258017-0ADF-47B0-ABE8-3DC89C05AC74},1.88092775200005,0.209091293058351
60,SCADDAN2020,GDA2020,121 42 0,121.7,1.00002781,50000,4100000,204.994,-28,Between Gold2020 & Esp2020,2017/03/31 08:00:00+00,121.117007032,-33.6406230159999,122.282993034,-32.3109318889999,{A11CAFC2-9013-478C-B589-7161A078B1C2},4.99135425799989,1.55040124106553
61,SHAWRVR2020,GDA2020,119 15 0,119.25,1.00001084,50000,2600000,69.9901,-1,Shaw River GDA2020,2017/03/31 08:00:00+00,118.85906628,-21.1345427539999,119.640933781,-20.0482060029999,{8768AA30-EA50-45D3-8F2D-784C3D90C4F3},3.73640850399988,0.849371400748773
62,SUNDAY2020,GDA2020,116 24 0,116.4,1.00001446,50000,2705744,100.029,-8,NWCH,2017/03/31 08:00:00+00,116.159131028,-21.694979255,116.640869028,-20.718262004,{6EAB1607-8A96-47C5-8A53-0C64065DB6D4},2.91691050200006,0.470521815062285
63,TOMPRICE2020,GDA2020,117 44 ,117.733333333333,1.00010103,50000,2850000,649.995,-7,Tom Price and Surrounds,2017/03/31 08:00:00+00,117.395555529,-22.7802777549999,118.095277779,-22.0783333799999,{99EBE8BE-9C10-44BA-86EE-1CCE79C1C983},2.80333325000004,0.491166097449857
64,URANDY2020,GDA2020,115 56 ,115.933333333333,1.0000253,50000,2868720,170.019,-9,Nanutarra to Wittenoom,2017/03/31 08:00:00+00,115.570214278,-22.868724006,116.296454278,-22.296568005,{BB59CF2F-898B-49A7-ABA3-F88D92240D36},2.59679200199992,0.415522574166215
65,WARRAD2020,GDA2020,115 19 ,115.316666666667,1.00002058,50000,3700000,159.979,-29,Brand Hwy,2017/03/31 08:00:00+00,115.057390151,-30.551887012,115.575943153,-29.514780012,{076E089E-F994-42CB-AAE2-FBC8CD4DA0A3},3.11132000399994,0.537794948245185
66,WHIMCRK2020,GDA2020,117 46 ,117.766666666667,1.00000534,50000,2700000,39.9859,-6,Whim Creek Townsite and surroundings.,2017/03/31 08:00:00+00,117.526351154,-21.347298004,118.006983155,-20.386035003,{DDEB8F4A-BB28-4EF0-9568-FC1440979AD1},2.88379000399993,0.462013759657881
67,WHIMEAST2020,GDA2020,117 56 ,117.933333333333,1.00000456,50000,2600000,36.0217,-7,NWCH East of Whim Creek,2017/03/31 08:00:00+00,117.602360905,-21.4157380039999,118.264304905,-20.2469930029999,{84F4174D-22EE-4C53-8C4D-A93794730CB7},3.66137800199988,0.773643740941878
68,WHIMWEST2020,GDA2020,117 34 ,117.566666666667,1.00000157,50000,2700000,15.9921,-6,NWCH West of Whim Creek,2017/03/31 08:00:00+00,117.326227154,-21.290253004,117.807107154,-20.452454003,{50FD54F0-487D-47E3-B31A-C666E420AA74},2.63735800199981,0.40288078360082
69,WUBIN2020,GDA2020,116 42 0,116.7,1.00004572,50000,3700000,314.98,-24,GNH,2017/03/31 08:00:00+00,116.208934653,-30.6810790129999,117.191065279,-29.3659397619999,{392D63F8-1423-43CC-9876-D645BB114210},4.59453975400015,1.2916385358619
70,YARINGA2020,GDA2020,114 22 ,114.366666666667,1.00000597,50000,3200000,58.9955,-21,NWCH,2017/03/31 08:00:00+00,114.029408401,-27.25326501,114.703924902,-25.0265380069999,{EE765BFE-F6FD-44C9-9BBC-8FA54C42CC49},5.80248700799996,1.50196410674572
71,MERREDIN2020,GDA2020,118 17 ,118.283333333333,1.00004949,50000,3800000,339.974,-25,GDA2020 Merredin Project Zone,2017/03/31 08:00:00+00,118.01277778,-31.875555514,118.70055553,-31.083333388,{5409405F-6A23-4CB6-B3D2-1384247CAA04},2.95999975200004,0.544872751320513
72,SCROSS2020,GDA2020,119 3 ,119.05,1.0000528,50000,3760000,360.04,-24,GDA94 Southern Cross Townsite,2017/03/31 08:00:00+00,118.62500003,-31.738888889,119.419166656,-30.728611137,{F20E0FBA-6372-461D-B28A-57DBE3436450},3.60888875600006,0.802328873628725
73,WOORLBA2020,GDA2020,124 39 0,124.65,1.00001681,50000,3900000,129.986,-23,GDA2020 Eyre Hwy - Woorlba,2017/03/31 08:00:00+00,124.230833285,-32.6008333899999,125.070833286,-32.1586111389999,{8AE4F95D-8C53-4B91-B90D-8E1162A9198B},2.56444450399999,0.371466691282211
74,VIRGINIA2020,GDA2020,125 11 ,125.183333333333,1.00001555,50000,3880000,119.966,-21,GDA2020 -  Eyre Hwy - VIRGINIA94,2017/03/31 08:00:00+00,124.976666661,-32.612777765,125.373333287,-31.884722264,{749FD38F-93F4-4AEA-A23E-DB1C3B6CBEA4},2.24944425399985,0.288795319122366
75,MILLSTREAM2020,GDA2020,117 2 ,117.033333333333,1.0000286,50000,2670000,190.022,-8,GDA2020 KARRATHA - TOM PRICE - MILLSTREAM2020,2017/03/31 08:00:00+00,116.793611154,-21.5069443799999,117.273055529,-20.9675000029999,{800C0A5E-001B-418C-802A-89BAA49324C6},2.03777750400013,0.258633572178065
76,BULDANIA2020,GDA2020,122 7 ,122.116666666667,1.00004305,50000,3880000,299.987,-26,GDA2020  Eyre Hwy BULDANIA2020,2017/03/31 08:00:00+00,121.736666658,-32.437500014,122.563055533,-31.799166639,{6BF7AC4F-35A8-4726-8B51-517F5E1A4A40},2.92944449999982,0.527511599641145
77,MALCOLM2020,GDA2020,122 48 ,122.8,1.00004965,50000,3880000,339.992,-24,GDA2020 Eyre Hwy MALCOLM2020,2017/03/31 08:00:00+00,122.434166658,-32.2719443889999,123.093611159,-31.8755555139999,{C1893DB6-0204-466B-92B9-D269ED314A68},2.11166675199991,0.261396463876311
78,COOLAWANYA2020,GDA2020,117 20 ,117.333333333333,1.00004604,50000,2720000,300.017,-7,GDA2020 KARRATHA-TOM-PRICE COOLAWANYA2020,2017/03/31 08:00:00+00,116.893611154,-21.94833338,117.64222228,-21.2391666289999,{EE9B6233-56DA-472C-BC5F-5DADEF2BE9AC},2.91555575400002,0.53089011998788
79,HAMERSLEY2020,GDA2020,117 42 ,117.7,1.00007118,50000,2780000,460.018,-7,GDA2020 Karratha - Tom Price  HAMERSLEY2020,2017/03/31 08:00:00+00,117.435833279,-22.16444438,117.938611155,-21.82694438,{BDB58D67-EF30-4C1A-A542-D301BE712564},1.68055575200015,0.169687533150021
80,GALVANS2020,GDA2020,125 50 ,125.833333333333,1.00006992,50000,2160000,414.999,30,Gibb River Rd GALVANS2020,2017/03/31 08:00:00+00,125.577500037,-17.308611125,126.084166662,-16.246666624,{22D04189-F19D-443B-8423-FC011F95F7C4},3.1372222519999,0.538051836258943
81,MUNG2020,GDA2020,120 37 ,120.616666666667,1.00001587,50000,4060000,130.003,-29,South Coast Hwy MUNG2020,2017/03/31 08:00:00+00,120.269444406,-33.9633333899999,120.939444407,-33.3811111399999,{C91B596A-0D8F-4143-9F29-E4850AD1F2D4},2.50444450200018,0.390088908082278
82,WYNDHAM2020,GDA2020,128 12 ,128.2,1.00002357,50000,2070000,115.009,35,Great Northern Hwy Dunham River WYNDHAM2020,2017/03/31 08:00:00+00,127.864444413,-16.4080554999999,128.482222165,-15.3930554989999,{EA200CA2-B508-4038-BCB1-4FF0E9BE975A},3.26555550399985,0.627044418279929
83,KELLER2020,GDA2020,117 39 0,117.65,1.00004148,50000,3810000,289.995,-26,GEHwy Kellerberrin KELLER2020,2017/03/31 08:00:00+00,117.347500029,-31.755000014,118.034166655,-31.112500013,{D35B5FB9-C795-4DBF-B0FA-F7E2C12DA08F},2.6583332539999,0.441183307891636
84,MARVEL2020,GDA2020,119 36 ,119.6,1.00006238,50000,3760000,421.011,-24,Great Eastern Hwy Marvel2020,2017/03/31 08:00:00+00,119.18805553,-31.695555514,120.011944406,-30.711944388,{A355950C-03A8-4B8C-B872-06605E280B10},3.61500000400008,0.810386265021279
85,FRAZER2020,GDA2020,122 28 ,122.466666666667,1.00004321,50000,3900000,301.006,-26,Eyre Hwy Norseman - Frazer Range,2017/03/31 08:00:00+00,122.138333284,-32.1997222639999,122.794722284,-31.9266666389999,{03F34815-37D4-423E-BB28-4DD303B173EB},1.85888924999995,0.179230708638112
86,HAHN2020,GDA2020,120 20 ,120.333333333333,1.0000462,50000,4000000,320.035,-26,Cascades Rd Intersect Lake king Rd - Norseman,2017/03/31 08:00:00+00,119.905277782,-33.454444391,120.763611157,-32.815555515,{C7FCBBC4-D5B1-4475-8B95-756A676E4CE4},2.99444450199985,0.548379645186991
87,STOKES2020,GDA2020,121 11 ,121.183333333333,1.00000676,50000,4080000,72.023,-29,South Coast Hwy ADJ Stokes National Park,2017/03/31 08:00:00+00,120.826388907,-33.9580555159999,121.540277783,-33.4794443909999,{534EA76D-657C-4931-9B55-7C097A7D1974},2.38500000200008,0.341675158067362
88,LAKEGRACE2020,GDA2020,118 17 ,118.283333333333,1.00004274,50000,4020000,299.014,-27,Collie - Lake King Rd,2017/03/31 08:00:00+00,117.853611154,-33.69083339,118.71305553,-32.970000015,{BA118A70-3FC9-4CAF-B4EF-D9CC2100665A},3.16055550199985,0.619516190176793
89,MUKINBUDIN2020,GDA2020,118 17 ,118.283333333333,1.00004965,50000,3740000,339.992,-24,M40 Koorda - Bullfinch Rd,2017/03/31 08:00:00+00,117.888055529,-31.312222264,118.76083328,-30.588611137,{19E90E15-4D31-42A0-85CD-167DCB612510},3.19277775599994,0.631551692021618
90,EASTALB2020,GDA2020,118 20 ,118.333333333333,1.00001271,50000,4100000,89.993,-9.101,East of Albany,2017/03/31 08:00:00+00,118.03333328,-35.0500000169999,118.63333328,-34.5166666409999,{5C736EC0-17E1-4CA1-B04B-D5B8D637C8C8},2.26666675200011,0.32000002560003
91,WARREL2020,GDA2020,119 39 0,119.65,1.00001697,50000,2640000,110.084,-2.08,Port Hedland - Marble Bar Rd,2017/03/31 08:00:00+00,119.503333281,-21.116944503,119.796666656,-20.560277753,{5D7F464F-EB03-4820-8A6A-511BF5C639AE},1.70000025000002,0.163288936527777
92,HYDEN2020,GDA2020,119 0 0,119,1.00004534,50000,4000000,315.001,-26.439,"Hyden, Brookton Hwy. 123",2017/03/31 08:00:00+00,118.62583328,-32.71361114,119.411388906,-32.287222264,{43963A17-47EF-4372-AAB3-0603F453606F},2.4238890040001,0.33495218040565
93,KOORDA2020,GDA2020,117 24 0,117.4,1.00005009,50000,4100000,341.982,-23.189,East of WUBIN2020 West of MTMAGSTH,2017/03/31 08:00:00+00,117.083333279,-31.5500000129999,117.716666654,-28.0833333859999,{2279EA4F-C899-436A-AC0A-64C3A2610C3B},8.200000004,2.1955556748778
94,DURACK2020,GDA2020,127 48 ,127.8,1.00002487,50000,2100000,122.772,35.511,"Gibb River Rd, West of Wyndham2020",2017/03/31 08:00:00+00,127.658333288,-15.916666624,127.941666664,-15.416666623,{F1C73D87-85D2-4658-82DB-279BB2BBA645},1.56666675399993,0.141666688283317